Reaction Details
TargetGlutamate receptor ionotropic, NMDA 2B
LigandBDBM50212687
Substrate/Competitorn/a
Meas. Tech.ChEMBL_455780 (CHEMBL887786)
Ki 8±n/a nM
Citation Nguyen, KTClaiborne, CFMcCauley, JALibby, BEClaremon, DABednar, RAMosser, SDGaul, SLConnolly, TMCondra, CLBednar, BStump, GLLynch, JJKoblan, KSLiverton, NJ Cyclic benzamidines as orally efficacious NR2B-selective NMDA receptor antagonists. Bioorg Med Chem Lett17:3997-4000 (2007) 
 
Glutamate receptor ionotropic, NMDA 2B
Name:Glutamate receptor ionotropic, NMDA 2B
Type:PROTEIN
Mol. Mass.:166375.46
Organism:Homo sapiens (Human)
Description:ChEMBL_1438829
Residue:1484
BDBM50212687
NameBDBM50212687
Synonyms:2-(3-chloro-benzyl)-5-trifluoromethoxy-2,3-dihydro-isoindol-1-ylideneamine | CHEMBL247718
TypeSmall organic molecule
Emp. Form.C16H12ClF3N2O
Mol. Mass.340.727
SMILESFC(F)(F)Oc1ccc2C(=N)N(Cc3cccc(Cl)c3)Cc2c1