Reaction Details
TargetGlutamate receptor ionotropic, NMDA 2B
LigandBDBM50124907
Substrate/Competitorn/a
Meas. Tech.ChEMBL_455780 (CHEMBL887786)
Ki 72±n/a nM
Citation Nguyen, KTClaiborne, CFMcCauley, JALibby, BEClaremon, DABednar, RAMosser, SDGaul, SLConnolly, TMCondra, CLBednar, BStump, GLLynch, JJKoblan, KSLiverton, NJ Cyclic benzamidines as orally efficacious NR2B-selective NMDA receptor antagonists. Bioorg Med Chem Lett17:3997-4000 (2007) 
 
Glutamate receptor ionotropic, NMDA 2B
Name:Glutamate receptor ionotropic, NMDA 2B
Type:PROTEIN
Mol. Mass.:166375.46
Organism:Homo sapiens (Human)
Description:ChEMBL_1438829
Residue:1484
BDBM50124907
NameBDBM50124907
Synonyms:4-trifluoromethoxy-N-(2-trifluoromethyl-benzyl)-benzamidine | CHEMBL159279
TypeSmall organic molecule
Emp. Form.C16H12F6N2O
Mol. Mass.362.2697
SMILESNC(=NCc1ccccc1C(F)(F)F)c1ccc(OC(F)(F)F)cc1