Reaction Details
TargetProto-oncogene tyrosine-protein kinase receptor Ret
LigandBDBM50212748
Substrate/Competitorn/a
Meas. Tech.ChEMBL_455801 (CHEMBL887807)
IC50 170±n/a nM
Citation Rizzi, ECassinelli, GDallavalle, SLanzi, CCincinelli, RNannei, RCuccuru, GZunino, F Synthesis and RET protein kinase inhibitory activity of 3-arylureidobenzylidene-indolin-2-ones. Bioorg Med Chem Lett17:3962-8 (2007) 
 
Proto-oncogene tyrosine-protein kinase receptor Ret
Name:Proto-oncogene tyrosine-protein kinase receptor Ret
Type:Protein
Mol. Mass.:124318.29
Organism:Homo sapiens (Human)
Description:P07949
Residue:1114
BDBM50212748
NameBDBM50212748
Synonyms:3-(4-hydroxybenzylidene)-5,6-dimethoxyindolin-2-one | CHEMBL391567
TypeSmall organic molecule
Emp. Form.C17H15NO4
Mol. Mass.297.3053
SMILESCOc1cc2NC(=O)\C(=C\c3ccc(O)cc3)c2cc1OC