Reaction Details
TargetFatty acid-binding protein, adipocyte
LigandBDBM50152850
Substrate/Competitorn/a
Meas. Tech.ChEMBL_455933 (CHEMBL887934)
Ki 336±n/a nM
Citation Sulsky, RMagnin, DRHuang, YSimpkins, LTaunk, PPatel, MZhu, YStouch, TRBassolino-Klimas, DParker, RHarrity, TStoffel, RTaylor, DSLavoie, TBKish, KJacobson, BLSheriff, SAdam, LPEwing, WRRobl, JA Potent and selective biphenyl azole inhibitors of adipocyte fatty acid binding protein (aFABP). Bioorg Med Chem Lett17:3511-5 (2007) 
 
Fatty acid-binding protein, adipocyte
Name:Fatty acid-binding protein, adipocyte
Type:Enzyme
Mol. Mass.:14719.23
Organism:Homo sapiens (Human)
Description:P15090
Residue:132
BDBM50152850
NameBDBM50152850
Synonyms:1-HEXYLDECANOIC ACID Hexadecanoic acid Palmitic acid (PA)
TypeSmall organic molecule
Emp. Form.C16H32O2
Mol. Mass.256.4241
(O)=O