Reaction Details
TargetFatty acid-binding protein, heart
LigandBDBM50212882
Substrate/Competitorn/a
Meas. Tech.ChEMBL_455934 (CHEMBL887935)
Ki 360±n/a nM
Citation Sulsky, RMagnin, DRHuang, YSimpkins, LTaunk, PPatel, MZhu, YStouch, TRBassolino-Klimas, DParker, RHarrity, TStoffel, RTaylor, DSLavoie, TBKish, KJacobson, BLSheriff, SAdam, LPEwing, WRRobl, JA Potent and selective biphenyl azole inhibitors of adipocyte fatty acid binding protein (aFABP). Bioorg Med Chem Lett17:3511-5 (2007) 
 
Fatty acid-binding protein, heart
Name:Fatty acid-binding protein, heart
Type:PROTEIN
Mol. Mass.:14858.36
Organism:Homo sapiens (Human)
Description:ChEMBL_1463784
Residue:133
BDBM50212882
NameBDBM50212882
Synonyms:CHEMBL248120 | [2'-(5-ethyl-3,4-diphenyl-pyrazol-1-yl)-biphenyl-3-yl]-hydroxy-acetic acid
TypeSmall organic molecule
Emp. Form.C31H26N2O3
Mol. Mass.474.5497
SMILESCCc1c(c(nn1-c1ccccc1-c1cccc(c1)C(O)C(O)=O)-c1ccccc1)-c1ccccc1