Reaction Details
TargetFatty acid-binding protein 5
LigandBDBM50150484
Substrate/Competitorn/a
Meas. Tech.ChEMBL_455935 (CHEMBL887936)
Ki 248±n/a nM
Citation Sulsky, RMagnin, DRHuang, YSimpkins, LTaunk, PPatel, MZhu, YStouch, TRBassolino-Klimas, DParker, RHarrity, TStoffel, RTaylor, DSLavoie, TBKish, KJacobson, BLSheriff, SAdam, LPEwing, WRRobl, JA Potent and selective biphenyl azole inhibitors of adipocyte fatty acid binding protein (aFABP). Bioorg Med Chem Lett17:3511-5 (2007) 
 
Fatty acid-binding protein 5
Name:Fatty acid-binding protein 5
Type:Enzyme
Mol. Mass.:15164.79
Organism:Homo sapiens (Human)
Description:Q01469
Residue:135
BDBM50150484
NameBDBM50150484
Synonyms:(Z)-9-octadecenoic acid CHEMBL8659 Octadec-9-enoic acid oleicacid
TypeSmall organic molecule
Emp. Form.C18H34O2
Mol. Mass.282.4614
SMILESCCCCCCCC\C=C/CCCCCCCC(O)=O