Reaction Details
TargetFatty acid-binding protein, adipocyte
LigandBDBM60927
Substrate/Competitorn/a
Meas. Tech.ChEMBL_455938 (CHEMBL887939)
Kd 150±n/a nM
Citation Sulsky, RMagnin, DRHuang, YSimpkins, LTaunk, PPatel, MZhu, YStouch, TRBassolino-Klimas, DParker, RHarrity, TStoffel, RTaylor, DSLavoie, TBKish, KJacobson, BLSheriff, SAdam, LPEwing, WRRobl, JA Potent and selective biphenyl azole inhibitors of adipocyte fatty acid binding protein (aFABP). Bioorg Med Chem Lett17:3511-5 (2007) 
 
Fatty acid-binding protein, adipocyte
Name:Fatty acid-binding protein, adipocyte
Type:Enzyme
Mol. Mass.:14719.23
Organism:Homo sapiens (Human)
Description:P15090
Residue:132
BDBM60927
NameBDBM60927
Synonyms:1-anilinonaphthalene-8-sulfonic acid ANS BDBM50126831
Typen/a
Emp. Form.C16H13NO3S
Mol. Mass.299.344
SMILESOS(=O)(=O)c1cccc2cccc(Nc3ccccc3)c12