Reaction Details
TargetDipeptidyl peptidase 4
LigandBDBM50212925
Substrate/Competitorn/a
Meas. Tech.ChEMBL_447405 (CHEMBL896429)
IC50 0.670000±n/a nM
Citation Gao, YDFeng, DSheridan, RPScapin, GPatel, SBWu, JKZhang, XSinha-Roy, RThornberry, NAWeber, AEBiftu, T Modeling assisted rational design of novel, potent, and selective pyrrolopyrimidine DPP-4 inhibitors. Bioorg Med Chem Lett17:3877-9 (2007) 
 
Dipeptidyl peptidase 4
Name:Dipeptidyl peptidase 4
Type:Enzyme
Mol. Mass.:88271.01
Organism:Homo sapiens (Human)
Description:P27487
Residue:766
BDBM50212925
NameBDBM50212925
Synonyms:(1S,2R,5S)-5-(5H-pyrrolo[3,4-d]pyrimidin-6(7H)-yl)-2-(2,4,5-trifluorophenyl)cyclohexanamine | CHEMBL233564
TypeSmall organic molecule
Emp. Form.C18H19F3N4
Mol. Mass.348.3655
SMILESN[C@H]1C[C@H](CC[C@@H]1c1cc(F)c(F)cc1F)N1Cc2cncnc2C1