Reaction Details
TargetCannabinoid receptor 1
LigandBDBM50213154
Substrate/Competitorn/a
Meas. Tech.ChEMBL_447433 (CHEMBL896457)
Ki 13±n/a nM
Citation Worm, KZhou, QJStabley, GJDeHaven, RNDolle, RE Biaryl cannabinoid mimetics--synthesis and structure-activity relationship. Bioorg Med Chem Lett17:3652-6 (2007) 
 
Cannabinoid receptor 1
Name:Cannabinoid receptor 1
Type:G Protein-Coupled Receptor (GPCR)
Mol. Mass.:52868.96
Organism:Homo sapiens (Human)
Description:P21554
Residue:472
BDBM50213154
NameBDBM50213154
Synonyms:4-(1-hexyl-cyclopropyl)-3',5'-dimethyl-biphenyl-2-ol | CHEMBL233633
TypeSmall organic molecule
Emp. Form.C23H30O
Mol. Mass.322.4837
SMILESCCCCCCC1(CC1)c1ccc(c(O)c1)-c1cc(C)cc(C)c1