Reaction Details
TargetCannabinoid receptor 1
LigandBDBM50213142
Substrate/Competitorn/a
Meas. Tech.ChEMBL_447433 (CHEMBL896457)
Ki>30000±n/a nM
Citation Worm, KZhou, QJStabley, GJDeHaven, RNDolle, RE Biaryl cannabinoid mimetics--synthesis and structure-activity relationship. Bioorg Med Chem Lett17:3652-6 (2007) 
 
Cannabinoid receptor 1
Name:Cannabinoid receptor 1
Type:G Protein-Coupled Receptor (GPCR)
Mol. Mass.:52868.96
Organism:Homo sapiens (Human)
Description:P21554
Residue:472
BDBM50213142
NameBDBM50213142
Synonyms:4'-(1,1-Dimethyl-heptyl)-3,5-dimethyl-biphenyl | CHEMBL61038
TypeSmall organic molecule
Emp. Form.C23H32
Mol. Mass.308.5002
SMILESCCCCCCC(C)(C)c1ccc(cc1)-c1cc(C)cc(C)c1