Reaction Details
TargetCannabinoid receptor 1
LigandBDBM50213160
Substrate/Competitorn/a
Meas. Tech.ChEMBL_447433 (CHEMBL896457)
Ki 15±n/a nM
Citation Worm, KZhou, QJStabley, GJDeHaven, RNDolle, RE Biaryl cannabinoid mimetics--synthesis and structure-activity relationship. Bioorg Med Chem Lett17:3652-6 (2007) 
 
Cannabinoid receptor 1
Name:Cannabinoid receptor 1
Type:G Protein-Coupled Receptor (GPCR)
Mol. Mass.:52868.96
Organism:Homo sapiens (Human)
Description:P21554
Residue:472
BDBM50213160
NameBDBM50213160
Synonyms:3'-amino-4-(1,1-dimethyl-heptyl)-biphenyl-2-ol | CHEMBL237897
TypeSmall organic molecule
Emp. Form.C21H29NO
Mol. Mass.311.4611
SMILESCCCCCCC(C)(C)c1ccc(c(O)c1)-c1cccc(N)c1