Reaction Details
TargetCannabinoid receptor 2
LigandBDBM50213141
Substrate/Competitorn/a
Meas. Tech.ChEMBL_447434 (CHEMBL896458)
Ki 1±n/a nM
Citation Worm, KZhou, QJStabley, GJDeHaven, RNDolle, RE Biaryl cannabinoid mimetics--synthesis and structure-activity relationship. Bioorg Med Chem Lett17:3652-6 (2007) 
 
Cannabinoid receptor 2
Name:Cannabinoid receptor 2
Type:G Protein-Coupled Receptor (GPCR)
Mol. Mass.:39690.94
Organism:Homo sapiens (Human)
Description:P34972
Residue:360
BDBM50213141
NameBDBM50213141
Synonyms:4-(1,1-dimethyl-heptyl)-2'-methoxy-biphenyl-2-ol | CHEMBL234678
TypeSmall organic molecule
Emp. Form.C22H30O2
Mol. Mass.326.4724
SMILESCCCCCCC(C)(C)c1ccc(c(O)c1)-c1ccccc1OC