Reaction Details
TargetCannabinoid receptor 2
LigandBDBM50213170
Substrate/Competitorn/a
Meas. Tech.ChEMBL_447434 (CHEMBL896458)
Ki 39±n/a nM
Citation Worm, KZhou, QJStabley, GJDeHaven, RNDolle, RE Biaryl cannabinoid mimetics--synthesis and structure-activity relationship. Bioorg Med Chem Lett17:3652-6 (2007) 
 
Cannabinoid receptor 2
Name:Cannabinoid receptor 2
Type:G Protein-Coupled Receptor (GPCR)
Mol. Mass.:39690.94
Organism:Homo sapiens (Human)
Description:P34972
Residue:360
BDBM50213170
NameBDBM50213170
Synonyms:6-(2-hydroxy-3',5'-dimethyl-biphenyl-4-yl)-6-methyl-heptanoic acid methylamide | CHEMBL391133
TypeSmall organic molecule
Emp. Form.C23H31NO2
Mol. Mass.353.4977
SMILESCNC(=O)CCCCC(C)(C)c1ccc(c(O)c1)-c1cc(C)cc(C)c1