Reaction Details
TargetDelta-type opioid receptor
LigandBDBM50213384
Substrate/Competitorn/a
Meas. Tech.ChEMBL_447456 (CHEMBL896479)
Ki 23±n/a nM
Citation Trabanco, AAAerts, NAlvarez, RMAndrés, JIBoeckx, IFernández, JGómez, AJanssens, FELeenaerts, JEDe Lucas, AIMatesanz, ESteckler, TPullan, S 4-Phenyl-4-[1H-imidazol-2-yl]-piperidine derivatives as non-peptidic selective delta-opioid agonists with potential anxiolytic/antidepressant properties. Part 2. Bioorg Med Chem Lett17:3860-3 (2007) 
 
Delta-type opioid receptor
Name:Delta-type opioid receptor
Type:G Protein-Coupled Receptor (GPCR)
Mol. Mass.:40382.98
Organism:Homo sapiens (Human)
Description:Competition binding assays were carried out using membrane preparations from transfected HN9.10 cells that constitutively expressed the delta opioid receptor.
Residue:372
BDBM50213384
NameBDBM50213384
Synonyms:1-(4-(1-benzyl-1H-imidazol-2-yl)-4-phenylpiperidin-1-yl)-2-phenylethanone | CHEMBL232582
TypeSmall organic molecule
Emp. Form.C29H29N3O
Mol. Mass.435.5601
SMILESO=C(Cc1ccccc1)N1CCC(CC1)(c1nccn1Cc1ccccc1)c1ccccc1