Reaction Details
TargetMu-type opioid receptor
LigandBDBM50213375
Substrate/Competitorn/a
Meas. Tech.ChEMBL_447457 (CHEMBL896480)
Ki>465±n/a nM
Citation Trabanco, AAAerts, NAlvarez, RMAndrés, JIBoeckx, IFernández, JGómez, AJanssens, FELeenaerts, JEDe Lucas, AIMatesanz, ESteckler, TPullan, S 4-Phenyl-4-[1H-imidazol-2-yl]-piperidine derivatives as non-peptidic selective delta-opioid agonists with potential anxiolytic/antidepressant properties. Part 2. Bioorg Med Chem Lett17:3860-3 (2007) 
 
Mu-type opioid receptor
Name:Mu-type opioid receptor
Type:G Protein-Coupled Receptor (GPCR)
Mol. Mass.:44789.51
Organism:Homo sapiens (Human)
Description:P35372
Residue:400
BDBM50213375
NameBDBM50213375
Synonyms:CHEMBL234389 | ethyl 4-(1-(1-methylnaphthalen-2-yl)-1H-imidazol-2-yl)-4-phenylpiperidine-1-carboxylate
TypeSmall organic molecule
Emp. Form.C28H29N3O2
Mol. Mass.439.5488
SMILESCCOC(=O)N1CCC(CC1)(c1nccn1-c1ccc2ccccc2c1C)c1ccccc1