Reaction Details
TargetMu-type opioid receptor
LigandBDBM50213402
Substrate/Competitorn/a
Meas. Tech.ChEMBL_447457 (CHEMBL896480)
Ki>465±n/a nM
Citation Trabanco, AAAerts, NAlvarez, RMAndrés, JIBoeckx, IFernández, JGómez, AJanssens, FELeenaerts, JEDe Lucas, AIMatesanz, ESteckler, TPullan, S 4-Phenyl-4-[1H-imidazol-2-yl]-piperidine derivatives as non-peptidic selective delta-opioid agonists with potential anxiolytic/antidepressant properties. Part 2. Bioorg Med Chem Lett17:3860-3 (2007) 
 
Mu-type opioid receptor
Name:Mu-type opioid receptor
Type:G Protein-Coupled Receptor (GPCR)
Mol. Mass.:44789.51
Organism:Homo sapiens (Human)
Description:P35372
Residue:400
BDBM50213402
NameBDBM50213402
Synonyms:CHEMBL234807 | ethyl 4-(1-(cyclohexylmethyl)-1H-imidazol-2-yl)-4-phenylpiperidine-1-carboxylate
TypeSmall organic molecule
Emp. Form.C24H33N3O2
Mol. Mass.395.5377
SMILESCCOC(=O)N1CCC(CC1)(c1nccn1CC1CCCCC1)c1ccccc1