Reaction Details
TargetMu-type opioid receptor
LigandBDBM50213407
Substrate/Competitorn/a
Meas. Tech.ChEMBL_447457 (CHEMBL896480)
Ki>4652±n/a nM
Citation Trabanco, AAAerts, NAlvarez, RMAndrés, JIBoeckx, IFernández, JGómez, AJanssens, FELeenaerts, JEDe Lucas, AIMatesanz, ESteckler, TPullan, S 4-Phenyl-4-[1H-imidazol-2-yl]-piperidine derivatives as non-peptidic selective delta-opioid agonists with potential anxiolytic/antidepressant properties. Part 2. Bioorg Med Chem Lett17:3860-3 (2007) 
 
Mu-type opioid receptor
Name:Mu-type opioid receptor
Type:G Protein-Coupled Receptor (GPCR)
Mol. Mass.:44789.51
Organism:Homo sapiens (Human)
Description:P35372
Residue:400
BDBM50213407
NameBDBM50213407
Synonyms:1-(4-(1-benzyl-1H-imidazol-2-yl)-4-phenylpiperidin-1-yl)-2,2-dimethylpropan-1-one | CHEMBL232581
TypeSmall organic molecule
Emp. Form.C26H31N3O
Mol. Mass.401.5438
SMILESCC(C)(C)C(=O)N1CCC(CC1)(c1nccn1Cc1ccccc1)c1ccccc1