Reaction Details
TargetGlyoxalase I
LigandBDBM50213420
Substrate/Competitorn/a
Meas. Tech.ChEMBL_456126 (CHEMBL888135)
Ki 66880±n/a nM
Citation More, SSVince, R Design, synthesis, and binding studies of bidentate Zn-chelating peptidic inhibitors of glyoxalase-I. Bioorg Med Chem Lett17:3793-7 (2007) 
 
Glyoxalase I
Name:Glyoxalase I
Type:PROTEIN
Mol. Mass.:37210.98
Organism:Saccharomyces cerevisiae
Description:ChEMBL_571116
Residue:326
BDBM50213420
NameBDBM50213420
Synonyms:(S)-5-((S)-7-(4-bromobenzyloxy)-1-(carboxymethylamino)-1,5,7-trioxoheptan-2-ylamino)-2-amino-5-oxopentanoic acid | CHEMBL246554
TypeSmall organic molecule
Emp. Form.C21H26BrN3O9
Mol. Mass.544.35
SMILESN[C@@H](CCC(=O)N[C@@H](CCC(=O)CC(=O)OCc1ccc(Br)cc1)C(=O)NCC(O)=O)C(O)=O