Reaction Details
TargetCannabinoid receptor 1
LigandBDBM50213482
Substrate/Competitorn/a
Meas. Tech.ChEMBL_456127 (CHEMBL887035)
Ki 631±n/a nM
Citation Ellsworth, BAWang, YZhu, YPendri, AGerritz, SWSun, CCarlson, KEKang, LBaska, RAYang, YHuang, QBurford, NTCullen, MJJohnghar, SBehnia, KPelleymounter, MAWashburn, WNEwing, WR Discovery of pyrazine carboxamide CB1 antagonists: the introduction of a hydroxyl group improves the pharmaceutical properties and in vivo efficacy of the series. Bioorg Med Chem Lett17:3978-82 (2007) 
 
Cannabinoid receptor 1
Name:Cannabinoid receptor 1
Type:G Protein-Coupled Receptor (GPCR)
Mol. Mass.:52868.96
Organism:Homo sapiens (Human)
Description:P21554
Residue:472
BDBM50213482
NameBDBM50213482
Synonyms:CHEMBL398114 | N-(2-phenoxyethyl)-5,6-dip-tolylpyrazine-2-carboxamide
TypeSmall organic molecule
Emp. Form.C27H25N3O2
Mol. Mass.423.5063
SMILESCc1ccc(cc1)-c1ncc(nc1-c1ccc(C)cc1)C(=O)NCCOc1ccccc1