Reaction Details
TargetTyrosine-protein phosphatase non-receptor type 1
LigandBDBM50213491
Substrate/Competitorn/a
Meas. Tech.ChEMBL_447477 (CHEMBL896500)
IC50 64900±n/a nM
Citation Na, MHoang, DMNjamen, DMbafor, JTFomum, ZTThuong, PTAhn, JSOh, WK Inhibitory effect of 2-arylbenzofurans from Erythrina addisoniae on protein tyrosine phosphatase-1B. Bioorg Med Chem Lett17:3868-71 (2007) 
 
Tyrosine-protein phosphatase non-receptor type 1
Name:Tyrosine-protein phosphatase non-receptor type 1
Type:Protein phosphatase
Mol. Mass.:49963.76
Organism:Homo sapiens (Human)
Description:Human recombinant GST-fusion PTP1B (1-435).
Residue:435
BDBM50213491
NameBDBM50213491
Synonyms:6-(6-hydroxybenzofuran-2-yl)-2,2-dimethyl-2H-chromen-5-ol | CHEMBL233766
TypeSmall organic molecule
Emp. Form.C19H16O4
Mol. Mass.308.3279
SMILESCC1(C)Oc2ccc(-c3cc4ccc(O)cc4o3)c(O)c2C=C1