Reaction Details
TargetCannabinoid receptor 1
LigandBDBM50213599
Substrate/Competitorn/a
Meas. Tech.ChEMBL_459063 (CHEMBL925155)
Ki 0.43±n/a nM
Citation Durdagi, SKapou, AKourouli, TAndreou, TNikas, SPNahmias, VRPapahatjis, DPPapadopoulos, MGMavromoustakos, T The application of 3D-QSAR studies for novel cannabinoid ligands substituted at the C1' position of the alkyl side chain on the structural requirements for binding to cannabinoid receptors CB1 and CB2. J Med Chem50:2875-85 (2007) 
 
Cannabinoid receptor 1
Name:Cannabinoid receptor 1
Type:G Protein-Coupled Receptor (GPCR)
Mol. Mass.:52868.96
Organism:Homo sapiens (Human)
Description:P21554
Residue:472
BDBM50213599
NameBDBM50213599
Synonyms:(6aR,10aR)-3-(6-bromo-2-methylhexan-2-yl)-6,6,9-trimethyl-6a,7,10,10a-tetrahydro-6H-benzo[c]chromen-1-ol | CHEMBL199561
TypeSmall organic molecule
Emp. Form.C23H33BrO2
Mol. Mass.421.411
SMILESCC1=CC[C@@H]2[C@@H](C1)c1c(O)cc(cc1OC2(C)C)C(C)(C)CCCCBr