Reaction Details
TargetCannabinoid receptor 2
LigandBDBM50169951
Substrate/Competitorn/a
Meas. Tech.ChEMBL_459064 (CHEMBL925156)
Ki 52±n/a nM
Citation Durdagi, SKapou, AKourouli, TAndreou, TNikas, SPNahmias, VRPapahatjis, DPPapadopoulos, MGMavromoustakos, T The application of 3D-QSAR studies for novel cannabinoid ligands substituted at the C1' position of the alkyl side chain on the structural requirements for binding to cannabinoid receptors CB1 and CB2. J Med Chem50:2875-85 (2007) 
 
Cannabinoid receptor 2
Name:Cannabinoid receptor 2
Type:G Protein-Coupled Receptor (GPCR)
Mol. Mass.:39690.94
Organism:Homo sapiens (Human)
Description:P34972
Residue:360
BDBM50169951
NameBDBM50169951
Synonyms:(6aR,10aR)-3-Adamantan-1-yl-6,6,9-trimethyl-6a,7,10,10a-tetrahydro-6H-benzo[c]chromen-1-ol AM-411 | CHEMBL434351
TypeSmall organic molecule
Emp. Form.C26H34O2
Mol. Mass.378.547
SMILESCC1=CC[C@@H]2[C@@H](C1)c1c(O)cc(cc1OC2(C)C)C12CC3CC(CC(C3)C1)C2