Reaction Details
TargetCannabinoid receptor 2
LigandBDBM50213600
Substrate/Competitorn/a
Meas. Tech.ChEMBL_459064 (CHEMBL925156)
Ki 105±n/a nM
Citation Durdagi, SKapou, AKourouli, TAndreou, TNikas, SPNahmias, VRPapahatjis, DPPapadopoulos, MGMavromoustakos, T The application of 3D-QSAR studies for novel cannabinoid ligands substituted at the C1' position of the alkyl side chain on the structural requirements for binding to cannabinoid receptors CB1 and CB2. J Med Chem50:2875-85 (2007) 
 
Cannabinoid receptor 2
Name:Cannabinoid receptor 2
Type:G Protein-Coupled Receptor (GPCR)
Mol. Mass.:39690.94
Organism:Homo sapiens (Human)
Description:P34972
Residue:360
BDBM50213600
NameBDBM50213600
Synonyms:1-(3,5-dihydroxy-4-((1R)-3-methyl-6-(prop-1-en-2-yl)cyclohex-2-enyl)phenyl)cyclopentanecarbonitrile CHEMBL238781
TypeSmall organic molecule
Emp. Form.C22H27NO2
Mol. Mass.337.4553
SMILESCC(=C)C1CCC(C)=C[C@H]1c1c(O)cc(cc1O)C1(CCCC1)C#N