Reaction Details
TargetCannabinoid receptor 1
LigandBDBM50133546
Substrate/Competitorn/a
Meas. Tech.ChEMBL_459063 (CHEMBL925155)
Ki 12.3±n/a nM
Citation Durdagi, SKapou, AKourouli, TAndreou, TNikas, SPNahmias, VRPapahatjis, DPPapadopoulos, MGMavromoustakos, T The application of 3D-QSAR studies for novel cannabinoid ligands substituted at the C1' position of the alkyl side chain on the structural requirements for binding to cannabinoid receptors CB1 and CB2. J Med Chem50:2875-85 (2007) 
 
Cannabinoid receptor 1
Name:Cannabinoid receptor 1
Type:G Protein-Coupled Receptor (GPCR)
Mol. Mass.:52868.96
Organism:Homo sapiens (Human)
Description:P21554
Residue:472
BDBM50133546
NameBDBM50133546
Synonyms:(6aR,10aR)-6,6,9-Trimethyl-3-(1-methyl-1-phenyl-ethyl)-6a,7,10,10a-tetrahydro-6H-benzo[c]chromen-1-ol 6,6,9-trimethyl-3-(2-phenylpropan-2-yl)-6a,7,10,10a-tetrahydro-6H-benzo[c]chromen-1-ol KM-233
TypeSmall organic molecule
Emp. Form.C25H30O2
Mol. Mass.362.5045
SMILESCC1=CC[C@@H]2[C@@H](C1)c1c(O)cc(cc1OC2(C)C)C(C)(C)c1ccccc1