Reaction Details
TargetCannabinoid receptor 2
LigandBDBM50213640
Substrate/Competitorn/a
Meas. Tech.ChEMBL_456157 (CHEMBL888169)
Ki 915±n/a nM
Citation Kai, HMorioka, YMurashi, TMorita, KShinonome, SNakazato, HKawamoto, KHanasaki, KTakahashi, FMihara, SArai, TAbe, KOkabe, HBaba, TYoshikawa, TTakenaka, H 2-Arylimino-5,6-dihydro-4H-1,3-thiazines as a new class of cannabinoid receptor agonists. Part 1: discovery of CB2 receptor selective compounds. Bioorg Med Chem Lett17:4030-4 (2007) 
 
Cannabinoid receptor 2
Name:Cannabinoid receptor 2
Type:G Protein-Coupled Receptor (GPCR)
Mol. Mass.:39690.94
Organism:Homo sapiens (Human)
Description:P34972
Residue:360
BDBM50213640
NameBDBM50213640
Synonyms:(Z)-N-(5,5-dimethyl-3-propyl-1,3-thiazinan-2-ylidene)-2-isopropylbenzenamine | CHEMBL247542
TypeSmall organic molecule
Emp. Form.C18H28N2S
Mol. Mass.304.493
SMILESCCCN1CC(C)(C)CS\C1=N/c1ccccc1C(C)C