Reaction Details
TargetCannabinoid receptor 2
LigandBDBM50213643
Substrate/Competitorn/a
Meas. Tech.ChEMBL_456157 (CHEMBL888169)
Ki>5000±n/a nM
Citation Kai, HMorioka, YMurashi, TMorita, KShinonome, SNakazato, HKawamoto, KHanasaki, KTakahashi, FMihara, SArai, TAbe, KOkabe, HBaba, TYoshikawa, TTakenaka, H 2-Arylimino-5,6-dihydro-4H-1,3-thiazines as a new class of cannabinoid receptor agonists. Part 1: discovery of CB2 receptor selective compounds. Bioorg Med Chem Lett17:4030-4 (2007) 
 
Cannabinoid receptor 2
Name:Cannabinoid receptor 2
Type:G Protein-Coupled Receptor (GPCR)
Mol. Mass.:39690.94
Organism:Homo sapiens (Human)
Description:P34972
Residue:360
BDBM50213643
NameBDBM50213643
Synonyms:(Z)-N-ethyl-2-(2-isopropylphenylimino)-5,5-dimethyl-1,3-thiazinane-3-carboxamide | CHEMBL248343
TypeSmall organic molecule
Emp. Form.C18H27N3OS
Mol. Mass.333.491
SMILESCCNC(=O)N1CC(C)(C)CSC1=Nc1ccccc1C(C)C