Reaction Details
TargetGonadotropin-releasing hormone receptor
LigandBDBM50213649
Substrate/Competitorn/a
Meas. Tech.ChEMBL_447479 (CHEMBL896502)
Ki 660±n/a nM
Citation Chen, MGuo, ZLanier, MCZhao, LBetz, SFHuang, CQLoweth, CJAshweek, NJLiu, XJStruthers, RSBradbury, MJBehan, JWWen, JO'Brien, ZSaunders, JZhu, YF Identification of 2-(4,5,6,7-tetrahydro-1H-pyrrolo[3,2-c]pyridin-3-yl)-ethylamine derivatives as novel GnRH receptor antagonists. Bioorg Med Chem Lett17:3845-50 (2007) 
 
Gonadotropin-releasing hormone receptor
Name:Gonadotropin-releasing hormone receptor
Type:PROTEIN
Mol. Mass.:37767.60
Organism:Rattus norvegicus
Description:ChEMBL_1335047
Residue:327
BDBM50213649
NameBDBM50213649
Synonyms:(S)-(2-(3,5-dimethylphenyl)-3-(1-(2-(pyridin-4-yl)ethylamino)propan-2-yl)-6,7-dihydro-1H-pyrrolo[3,2-c]pyridin-5(4H)-yl)(phenyl)methanone | CHEMBL401225
TypeSmall organic molecule
Emp. Form.C32H36N4O
Mol. Mass.492.6544
SMILESC[C@H](CNCCc1ccncc1)c1c2CN(CCc2[nH]c1-c1cc(C)cc(C)c1)C(=O)c1ccccc1