Reaction Details
TargetGonadotropin-releasing hormone receptor
LigandBDBM50213657
Substrate/Competitorn/a
Meas. Tech.ChEMBL_447479 (CHEMBL896502)
Ki 0.7±n/a nM
Citation Chen, MGuo, ZLanier, MCZhao, LBetz, SFHuang, CQLoweth, CJAshweek, NJLiu, XJStruthers, RSBradbury, MJBehan, JWWen, JO'Brien, ZSaunders, JZhu, YF Identification of 2-(4,5,6,7-tetrahydro-1H-pyrrolo[3,2-c]pyridin-3-yl)-ethylamine derivatives as novel GnRH receptor antagonists. Bioorg Med Chem Lett17:3845-50 (2007) 
 
Gonadotropin-releasing hormone receptor
Name:Gonadotropin-releasing hormone receptor
Type:PROTEIN
Mol. Mass.:37767.60
Organism:Rattus norvegicus
Description:ChEMBL_1335047
Residue:327
BDBM50213657
NameBDBM50213657
Synonyms:(S)-1-(2-(3,5-dimethylphenyl)-3-(1-(2-(6-fluoro-1H-benzo[d][1,2,3]triazol-5-yl)ethylamino)propan-2-yl)-6,7-dihydro-1H-pyrrolo[3,2-c]pyridin-5(4H)-yl)-2-(2-fluoro-6-(trifluoromethyl)phenyl)ethanone | CHEMBL231761
TypeSmall organic molecule
Emp. Form.C35H35F5N6O
Mol. Mass.650.684
SMILESC[C@H](CNCCc1cc2[nH]nnc2cc1F)c1c2CN(CCc2[nH]c1-c1cc(C)cc(C)c1)C(=O)Cc1c(F)cccc1C(F)(F)F