Reaction Details
TargetGonadotropin-releasing hormone receptor
LigandBDBM50213660
Substrate/Competitorn/a
Meas. Tech.ChEMBL_447478 (CHEMBL896501)
IC50 63±n/a nM
Citation Chen, MGuo, ZLanier, MCZhao, LBetz, SFHuang, CQLoweth, CJAshweek, NJLiu, XJStruthers, RSBradbury, MJBehan, JWWen, JO'Brien, ZSaunders, JZhu, YF Identification of 2-(4,5,6,7-tetrahydro-1H-pyrrolo[3,2-c]pyridin-3-yl)-ethylamine derivatives as novel GnRH receptor antagonists. Bioorg Med Chem Lett17:3845-50 (2007) 
 
Gonadotropin-releasing hormone receptor
Name:Gonadotropin-releasing hormone receptor
Type:Enzyme
Mol. Mass.:37749.45
Organism:Homo sapiens (Human)
Description:P30968
Residue:328
BDBM50213660
NameBDBM50213660
Synonyms:(S)-1-(3-(1-(2-(4-(1H-tetrazol-5-yl)phenoxy)ethylamino)propan-2-yl)-2-(3,5-dimethylphenyl)-6,7-dihydro-1H-pyrrolo[3,2-c]pyridin-5(4H)-yl)-2-(2-fluoro-6-(trifluoromethyl)phenyl)ethanone | CHEMBL394634
TypeSmall organic molecule
Emp. Form.C36H37F4N7O2
Mol. Mass.675.7183
SMILESC[C@H](CNCCOc1ccc(cc1)-c1nnn[nH]1)c1c2CN(CCc2[nH]c1-c1cc(C)cc(C)c1)C(=O)Cc1c(F)cccc1C(F)(F)F