Reaction Details
TargetGonadotropin-releasing hormone receptor
LigandBDBM50213671
Substrate/Competitorn/a
Meas. Tech.ChEMBL_447479 (CHEMBL896502)
Ki 0.3±n/a nM
Citation Chen, MGuo, ZLanier, MCZhao, LBetz, SFHuang, CQLoweth, CJAshweek, NJLiu, XJStruthers, RSBradbury, MJBehan, JWWen, JO'Brien, ZSaunders, JZhu, YF Identification of 2-(4,5,6,7-tetrahydro-1H-pyrrolo[3,2-c]pyridin-3-yl)-ethylamine derivatives as novel GnRH receptor antagonists. Bioorg Med Chem Lett17:3845-50 (2007) 
 
Gonadotropin-releasing hormone receptor
Name:Gonadotropin-releasing hormone receptor
Type:PROTEIN
Mol. Mass.:37767.60
Organism:Rattus norvegicus
Description:ChEMBL_1335047
Residue:327
BDBM50213671
NameBDBM50213671
Synonyms:(S)-1-(2-(3,5-dimethylphenyl)-3-(1-(2-(quinoxalin-6-yl)ethylamino)propan-2-yl)-6,7-dihydro-1H-pyrrolo[3,2-c]pyridin-5(4H)-yl)-2-(2-fluoro-6-(trifluoromethyl)phenyl)ethanone | CHEMBL395225
TypeSmall organic molecule
Emp. Form.C37H37F4N5O
Mol. Mass.643.7162
SMILESC[C@H](CNCCc1ccc2nccnc2c1)c1c2CN(CCc2[nH]c1-c1cc(C)cc(C)c1)C(=O)Cc1c(F)cccc1C(F)(F)F