Reaction Details
TargetGonadotropin-releasing hormone receptor
LigandBDBM50213652
Substrate/Competitorn/a
Meas. Tech.ChEMBL_447480 (CHEMBL896503)
IC50 6.4±n/a nM
Citation Chen, MGuo, ZLanier, MCZhao, LBetz, SFHuang, CQLoweth, CJAshweek, NJLiu, XJStruthers, RSBradbury, MJBehan, JWWen, JO'Brien, ZSaunders, JZhu, YF Identification of 2-(4,5,6,7-tetrahydro-1H-pyrrolo[3,2-c]pyridin-3-yl)-ethylamine derivatives as novel GnRH receptor antagonists. Bioorg Med Chem Lett17:3845-50 (2007) 
 
Gonadotropin-releasing hormone receptor
Name:Gonadotropin-releasing hormone receptor
Type:PROTEIN
Mol. Mass.:37767.60
Organism:Rattus norvegicus
Description:ChEMBL_1335047
Residue:327
BDBM50213652
NameBDBM50213652
Synonyms:(S)-1-(3-(1-(2-(3H-[1,2,3]triazolo[4,5-b]pyridin-6-yl)ethylamino)propan-2-yl)-2-(3,5-dimethylphenyl)-6,7-dihydro-1H-pyrrolo[3,2-c]pyridin-5(4H)-yl)-2-(2-fluoro-6-(trifluoromethyl)phenyl)ethanone | CHEMBL267838
TypeSmall organic molecule
Emp. Form.C34H35F4N7O
Mol. Mass.633.6816
SMILESC[C@H](CNCCc1cnc2nn[nH]c2c1)c1c2CN(CCc2[nH]c1-c1cc(C)cc(C)c1)C(=O)Cc1c(F)cccc1C(F)(F)F