Reaction Details
TargetKinesin-like protein KIF11
LigandBDBM23772
Substrate/Competitorn/a
Meas. Tech.ChEMBL_447486 (CHEMBL896510)
IC50 1800±n/a nM
Citation Ogo, NOishi, SMatsuno, KSawada, JFujii, NAsai, A Synthesis and biological evaluation of L-cysteine derivatives as mitotic kinesin Eg5 inhibitors. Bioorg Med Chem Lett17:3921-4 (2007) 
 
Kinesin-like protein KIF11
Name:Kinesin-like protein KIF11
Type:PROTEIN
Mol. Mass.:119138.97
Organism:Homo sapiens (Human)
Description:ChEMBL_1457426
Residue:1056
BDBM23772
NameBDBM23772
Synonyms:(2R)-2-amino-3-[(triphenylmethyl)sulfanyl]propanoic acid CHEMBL392695 S-Trityl-L-Cysteine (STLC), 1 Tritylcysteine
TypeSmall organic molecule
Emp. Form.C22H21NO2S
Mol. Mass.363.473
SMILESN[C@@H](CSC(c1ccccc1)(c1ccccc1)c1ccccc1)C(O)=O