Reaction Details
TargetC-X-C chemokine receptor type 1
LigandBDBM50213747
Substrate/Competitorn/a
Meas. Tech.ChEMBL_447495 (CHEMBL896518)
IC50 24000±n/a nM
Citation Wang, YBusch-Petersen, JWang, FMa, LFu, WKerns, JKJin, JPalovich, MRShen, JKBurman, MFoley, JJSchmidt, DBHunsberger, GESarau, HMWiddowson, KL 3-Arylamino-2H-1,2,4-benzothiadiazin-5-ol 1,1-dioxides as novel and selective CXCR2 antagonists. Bioorg Med Chem Lett17:3864-7 (2007) 
 
C-X-C chemokine receptor type 1
Name:C-X-C chemokine receptor type 1
Type:Enzyme
Mol. Mass.:39803.83
Organism:Homo sapiens (Human)
Description:P25024
Residue:350
BDBM50213747
NameBDBM50213747
Synonyms:7-chloro-3-(2-chloro-phenylamino)-1,1-dioxo-1,4-dihydro-1lambda6-benzo[1,2,4]thiadiazin-5-ol | CHEMBL234186
TypeSmall organic molecule
Emp. Form.C13H9Cl2N3O3S
Mol. Mass.358.2
SMILESOc1cc(Cl)cc2c1N=C(Nc1ccccc1Cl)NS2(=O)=O