Reaction Details
TargetC-X-C chemokine receptor type 2
LigandBDBM50213761
Substrate/Competitorn/a
Meas. Tech.ChEMBL_447494 (CHEMBL896517)
IC50 360±n/a nM
Citation Wang, YBusch-Petersen, JWang, FMa, LFu, WKerns, JKJin, JPalovich, MRShen, JKBurman, MFoley, JJSchmidt, DBHunsberger, GESarau, HMWiddowson, KL 3-Arylamino-2H-1,2,4-benzothiadiazin-5-ol 1,1-dioxides as novel and selective CXCR2 antagonists. Bioorg Med Chem Lett17:3864-7 (2007) 
 
C-X-C chemokine receptor type 2
Name:C-X-C chemokine receptor type 2
Type:Protein
Mol. Mass.:40767.88
Organism:Homo sapiens (Human)
Description:P25025
Residue:360
BDBM50213761
NameBDBM50213761
Synonyms:3-(2-bromo-phenylamino)-7-fluoro-1,1-dioxo-1,4-dihydro-1lambda6-benzo[1,2,4]thiadiazin-5-ol | CHEMBL234178
TypeSmall organic molecule
Emp. Form.C13H9BrFN3O3S
Mol. Mass.386.196
SMILESOc1cc(F)cc2c1N=C(Nc1ccccc1Br)NS2(=O)=O