Reaction Details
Target5-hydroxytryptamine receptor 1A
LigandBDBM50213737
Substrate/Competitorn/a
Meas. Tech.ChEMBL_447502 (CHEMBL896525)
IC50>3200±n/a nM
Citation Wang, YBusch-Petersen, JWang, FMa, LFu, WKerns, JKJin, JPalovich, MRShen, JKBurman, MFoley, JJSchmidt, DBHunsberger, GESarau, HMWiddowson, KL 3-Arylamino-2H-1,2,4-benzothiadiazin-5-ol 1,1-dioxides as novel and selective CXCR2 antagonists. Bioorg Med Chem Lett17:3864-7 (2007) 
 
5-hydroxytryptamine receptor 1A
Name:5-hydroxytryptamine receptor 1A
Type:n/a
Mol. Mass.:46122.49
Organism:Homo sapiens (Human)
Description:n/a
Residue:422
BDBM50213737
NameBDBM50213737
Synonyms:7-nitro-1,1-dioxo-3-(2-phenoxy-phenylamino)-1,4-dihydro-1lambda6-benzo[1,2,4]thiadiazin-5-ol | CHEMBL399203
TypeSmall organic molecule
Emp. Form.C19H14N4O6S
Mol. Mass.426.403
SMILESOc1cc(cc2c1N=C(Nc1ccccc1Oc1ccccc1)NS2(=O)=O)[N+]([O-])=O