Reaction Details
TargetCannabinoid receptor 2
LigandBDBM50213892
Substrate/Competitorn/a
Meas. Tech.ChEMBL_447525 (CHEMBL895424)
Ki 11±n/a nM
Citation Kai, HMorioka, YTomida, MTakahashi, THattori, MHanasaki, KKoike, KChiba, HShinohara, SKanemasa, TIwamoto, YTakahashi, KYamaguchi, YBaba, TYoshikawa, TTakenaka, H 2-Arylimino-5,6-dihydro-4H-1,3-thiazines as a new class of cannabinoid receptor agonists. Part 2: orally bioavailable compounds. Bioorg Med Chem Lett17:3925-9 (2007) 
 
Cannabinoid receptor 2
Name:Cannabinoid receptor 2
Type:G Protein-Coupled Receptor (GPCR)
Mol. Mass.:39690.94
Organism:Homo sapiens (Human)
Description:P34972
Residue:360
BDBM50213892
NameBDBM50213892
Synonyms:3-[(Z)-quinolin-5-ylimino]-2-thia-4-aza-spiro[5.5]undecane-4-carbodithioic acid methyl ester | CHEMBL398145
TypeSmall organic molecule
Emp. Form.C20H23N3S3
Mol. Mass.401.612
SMILESCSC(=S)N1CC2(CCCCC2)CS\C1=N/c1cccc2ncccc12