Reaction Details
TargetCannabinoid receptor 1
LigandBDBM50213899
Substrate/Competitorn/a
Meas. Tech.ChEMBL_447526 (CHEMBL895425)
Ki 13±n/a nM
Citation Kai, HMorioka, YTomida, MTakahashi, THattori, MHanasaki, KKoike, KChiba, HShinohara, SKanemasa, TIwamoto, YTakahashi, KYamaguchi, YBaba, TYoshikawa, TTakenaka, H 2-Arylimino-5,6-dihydro-4H-1,3-thiazines as a new class of cannabinoid receptor agonists. Part 2: orally bioavailable compounds. Bioorg Med Chem Lett17:3925-9 (2007) 
 
Cannabinoid receptor 1
Name:Cannabinoid receptor 1
Type:G Protein-Coupled Receptor (GPCR)
Mol. Mass.:52868.96
Organism:Homo sapiens (Human)
Description:P21554
Residue:472
BDBM50213899
NameBDBM50213899
Synonyms:3-[(Z)-2-methoxy-phenylimino]-2-thia-4-aza-spiro[5.5]undecane-4-carbodithioic acid methyl ester | CHEMBL231721
TypeSmall organic molecule
Emp. Form.C18H24N2OS3
Mol. Mass.380.591
SMILESCOc1ccccc1\N=C1/SCC2(CCCCC2)CN1C(=S)SC