Reaction Details
TargetCannabinoid receptor 1
LigandBDBM50213881
Substrate/Competitorn/a
Meas. Tech.ChEMBL_447526 (CHEMBL895425)
Ki 122±n/a nM
Citation Kai, HMorioka, YTomida, MTakahashi, THattori, MHanasaki, KKoike, KChiba, HShinohara, SKanemasa, TIwamoto, YTakahashi, KYamaguchi, YBaba, TYoshikawa, TTakenaka, H 2-Arylimino-5,6-dihydro-4H-1,3-thiazines as a new class of cannabinoid receptor agonists. Part 2: orally bioavailable compounds. Bioorg Med Chem Lett17:3925-9 (2007) 
 
Cannabinoid receptor 1
Name:Cannabinoid receptor 1
Type:G Protein-Coupled Receptor (GPCR)
Mol. Mass.:52868.96
Organism:Homo sapiens (Human)
Description:P21554
Residue:472
BDBM50213881
NameBDBM50213881
Synonyms:3-[(Z)-2-isopropyl-phenylimino]-2-thia-4-aza-spiro[5.5]undecane-4-carbodithioic acid methyl ester | CHEMBL443842
TypeSmall organic molecule
Emp. Form.C20H28N2S3
Mol. Mass.392.645
SMILESCSC(=S)N1CC2(CCCCC2)CS\C1=N/c1ccccc1C(C)C