Reaction Details
TargetProstaglandin D2 receptor 2
LigandBDBM50213911
Substrate/Competitorn/a
Meas. Tech.ChEMBL_456177 (CHEMBL888187)
Ki 20±n/a nM
Citation Sandham, DAAldcroft, CBaettig, UBarker, LBeer, DBhalay, GBrown, ZDubois, GBudd, DBidlake, LCampbell, ECox, BEveratt, BHarrison, DLeblanc, CJManini, JProfit, RStringer, RThompson, KSTurner, KLTweed, MFWalker, CWatson, SJWhitebread, SWillis, JWilliams, GWilson, C 2-Cycloalkyl phenoxyacetic acid CRTh2 receptor antagonists. Bioorg Med Chem Lett17:4347-50 (2007) 
 
Prostaglandin D2 receptor 2
Name:Prostaglandin D2 receptor 2
Type:Enzyme
Mol. Mass.:43295.45
Organism:Homo sapiens (Human)
Description:Q9Y5Y4
Residue:395
BDBM50213911
NameBDBM50213911
Synonyms:2-(2-cyclohexyl-4-(trifluoromethyl)phenoxy)acetic acid | CHEMBL397650
TypeSmall organic molecule
Emp. Form.C15H17F3O3
Mol. Mass.302.2889
SMILESOC(=O)COc1ccc(cc1C1CCCCC1)C(F)(F)F