Reaction Details
TargetTranscription factor Jun
LigandBDBM50213935
Substrate/Competitorn/a
Meas. Tech.ChEMBL_456206 (CHEMBL888216)
IC50>300±n/a nM
Citation Gao, WBussom, SGrill, SPGullen, EAHu, YCHuang, XZhong, SKaczmarek, CGutierrez, JFrancis, SBaker, DCYu, SCheng, YC Structure-activity studies of phenanthroindolizidine alkaloids as potential antitumor agents. Bioorg Med Chem Lett17:4338-42 (2007) 
 
Transcription factor Jun
Name:Transcription factor Jun
Type:n/a
Mol. Mass.:35683.24
Organism:Homo sapiens (Human)
Description:P05412
Residue:331
BDBM50213935
NameBDBM50213935
Synonyms:(12aS,13R)-2,3,6,7-tetramethoxy-9,10,11,12,12a,13-hexahydro-9a-aza-cyclopenta[b]triphenylen-13-ol | CHEMBL399965
TypeSmall organic molecule
Emp. Form.C24H27NO5
Mol. Mass.409.4749
SMILESCOc1cc2c3CN4CCC[C@H]4[C@H](O)c3c3cc(OC)c(OC)cc3c2cc1OC