Reaction Details
TargetTranscription factor Jun
LigandBDBM50213931
Substrate/Competitorn/a
Meas. Tech.ChEMBL_456206 (CHEMBL888216)
IC50 65±n/a nM
Citation Gao, WBussom, SGrill, SPGullen, EAHu, YCHuang, XZhong, SKaczmarek, CGutierrez, JFrancis, SBaker, DCYu, SCheng, YC Structure-activity studies of phenanthroindolizidine alkaloids as potential antitumor agents. Bioorg Med Chem Lett17:4338-42 (2007) 
 
Transcription factor Jun
Name:Transcription factor Jun
Type:n/a
Mol. Mass.:35683.24
Organism:Homo sapiens (Human)
Description:P05412
Residue:331
BDBM50213931
NameBDBM50213931
Synonyms:CHEMBL250854 | tylophorinidine
TypeSmall organic molecule
Emp. Form.C22H23NO4
Mol. Mass.365.4223
SMILESCOc1ccc2c3[C@H](O)[C@@H]4CCCN4Cc3c3cc(OC)c(O)cc3c2c1