Reaction Details
TargetTranscription factor Jun
LigandBDBM50213932
Substrate/Competitorn/a
Meas. Tech.ChEMBL_456206 (CHEMBL888216)
IC50 68±n/a nM
Citation Gao, WBussom, SGrill, SPGullen, EAHu, YCHuang, XZhong, SKaczmarek, CGutierrez, JFrancis, SBaker, DCYu, SCheng, YC Structure-activity studies of phenanthroindolizidine alkaloids as potential antitumor agents. Bioorg Med Chem Lett17:4338-42 (2007) 
 
Transcription factor Jun
Name:Transcription factor Jun
Type:n/a
Mol. Mass.:35683.24
Organism:Homo sapiens (Human)
Description:P05412
Residue:331
BDBM50213932
NameBDBM50213932
Synonyms:CHEMBL250474 | [(R)-(+)-deoxytylophorinidine
TypeSmall organic molecule
Emp. Form.C22H23NO3
Mol. Mass.349.4229
SMILESCOc1ccc2c3C[C@H]4CCCN4Cc3c3cc(OC)c(O)cc3c2c1