Reaction Details
TargetMelanin-concentrating hormone receptor 1
LigandBDBM50214053
Substrate/Competitorn/a
Meas. Tech.ChEMBL_456228 (CHEMBL888238)
IC50 57±n/a nM
Citation Giordanetto, FKarlsson, OLindberg, JLarsson, LOLinusson, AEvertsson, EMorgan, DGInghardt, T Discovery of cyclopentane- and cyclohexane-trans-1,3-diamines as potent melanin-concentrating hormone receptor 1 antagonists. Bioorg Med Chem Lett17:4232-41 (2007) 
 
Melanin-concentrating hormone receptor 1
Name:Melanin-concentrating hormone receptor 1
Type:G Protein-Coupled Receptor (GPCR)
Mol. Mass.:45976.27
Organism:Homo sapiens (Human)
Description:Membranes from CHO-K1 cells stably expressing human MCH1R were used in assays.
Residue:422
BDBM50214053
NameBDBM50214053
Synonyms:(1S,3S)-N1-(6-methoxyquinolin-2-yl)-N3-(thiophen-3-ylmethyl)cyclohexane-1,3-diamine | CHEMBL250540
TypeSmall organic molecule
Emp. Form.C21H25N3OS
Mol. Mass.367.508
SMILESCOc1ccc2nc(N[C@H]3CCC[C@@H](C3)NCc3ccsc3)ccc2c1