Reaction Details
TargetMelanin-concentrating hormone receptor 1
LigandBDBM50214052
Substrate/Competitorn/a
Meas. Tech.ChEMBL_456229 (CHEMBL888239)
IC50 8±n/a nM
Citation Giordanetto, FKarlsson, OLindberg, JLarsson, LOLinusson, AEvertsson, EMorgan, DGInghardt, T Discovery of cyclopentane- and cyclohexane-trans-1,3-diamines as potent melanin-concentrating hormone receptor 1 antagonists. Bioorg Med Chem Lett17:4232-41 (2007) 
 
Melanin-concentrating hormone receptor 1
Name:Melanin-concentrating hormone receptor 1
Type:G Protein-Coupled Receptor (GPCR)
Mol. Mass.:45976.27
Organism:Homo sapiens (Human)
Description:Membranes from CHO-K1 cells stably expressing human MCH1R were used in assays.
Residue:422
BDBM50214052
NameBDBM50214052
Synonyms:(1S,3S)-N1-(4-methoxyquinolin-2-yl)-N3-(thiophen-3-ylmethyl)cyclohexane-1,3-diamine | CHEMBL249489
TypeSmall organic molecule
Emp. Form.C21H25N3OS
Mol. Mass.367.508
SMILESCOc1cc(N[C@H]2CCC[C@@H](C2)NCc2ccsc2)nc2ccccc12