Reaction Details
TargetMelanin-concentrating hormone receptor 1
LigandBDBM50214055
Substrate/Competitorn/a
Meas. Tech.ChEMBL_456229 (CHEMBL888239)
IC50 97±n/a nM
Citation Giordanetto, FKarlsson, OLindberg, JLarsson, LOLinusson, AEvertsson, EMorgan, DGInghardt, T Discovery of cyclopentane- and cyclohexane-trans-1,3-diamines as potent melanin-concentrating hormone receptor 1 antagonists. Bioorg Med Chem Lett17:4232-41 (2007) 
 
Melanin-concentrating hormone receptor 1
Name:Melanin-concentrating hormone receptor 1
Type:G Protein-Coupled Receptor (GPCR)
Mol. Mass.:45976.27
Organism:Homo sapiens (Human)
Description:Membranes from CHO-K1 cells stably expressing human MCH1R were used in assays.
Residue:422
BDBM50214055
NameBDBM50214055
Synonyms:CHEMBL399244 | N4,N4-dimethyl-N2-((1S,3S)-3-(thiophen-3-ylmethylamino)cyclohexyl)quinoline-2,4-diamine
TypeSmall organic molecule
Emp. Form.C22H28N4S
Mol. Mass.380.55
SMILESCN(C)c1cc(N[C@H]2CCC[C@@H](C2)NCc2ccsc2)nc2ccccc12