Reaction Details
TargetMelanin-concentrating hormone receptor 1
LigandBDBM50214068
Substrate/Competitorn/a
Meas. Tech.ChEMBL_456228 (CHEMBL888238)
IC50 15±n/a nM
Citation Giordanetto, FKarlsson, OLindberg, JLarsson, LOLinusson, AEvertsson, EMorgan, DGInghardt, T Discovery of cyclopentane- and cyclohexane-trans-1,3-diamines as potent melanin-concentrating hormone receptor 1 antagonists. Bioorg Med Chem Lett17:4232-41 (2007) 
 
Melanin-concentrating hormone receptor 1
Name:Melanin-concentrating hormone receptor 1
Type:G Protein-Coupled Receptor (GPCR)
Mol. Mass.:45976.27
Organism:Homo sapiens (Human)
Description:Membranes from CHO-K1 cells stably expressing human MCH1R were used in assays.
Residue:422
BDBM50214068
NameBDBM50214068
Synonyms:6-methoxy-4-methyl-N-(3-(thiophen-3-ylmethylamino)propyl)quinolin-2-amine | CHEMBL400679
TypeSmall organic molecule
Emp. Form.C19H23N3OS
Mol. Mass.341.47
SMILESCOc1ccc2nc(NCCCNCc3ccsc3)cc(C)c2c1