Reaction Details
TargetCyclin-dependent kinase 1
LigandBDBM50214108
Substrate/Competitorn/a
Meas. Tech.ChEMBL_456265 (CHEMBL888275)
IC50 1.1±n/a nM
Citation Lin, RConnolly, PJLu, YChiu, GLi, SYu, YHuang, SLi, XEmanuel, SLMiddleton, SAGruninger, RHAdams, MFuentes-Pesquera, ARGreenberger, LM Synthesis and evaluation of pyrazolo[3,4-b]pyridine CDK1 inhibitors as anti-tumor agents. Bioorg Med Chem Lett17:4297-302 (2007) 
 
Cyclin-dependent kinase 1
Name:Cyclin-dependent kinase 1
Type:Enzyme Subunit
Mol. Mass.:34101.08
Organism:Homo sapiens (Human)
Description:P06493
Residue:297
BDBM50214108
NameBDBM50214108
Synonyms:CHEMBL248712 | N-((5-(3-(5,6-difluoro-1H-benzo[d]imidazol-2-yl)-1H-pyrazolo[3,4-b]pyridin-5-yl)pyridin-3-yl)methyl)ethanamine
TypeSmall organic molecule
Emp. Form.C21H17F2N7
Mol. Mass.405.4034
SMILESCCNCc1cncc(c1)-c1cnc2n[nH]c(-c3nc4cc(F)c(F)cc4[nH]3)c2c1