Reaction Details
TargetPeroxisome proliferator-activated receptor delta
LigandBDBM50214202
Substrate/Competitorn/a
Meas. Tech.ChEMBL_437000 (CHEMBL886016)
EC50 4.8±n/a nM
Citation Kasuga, JNakagome, IAoyama, ASako, KIshizawa, MOgura, MMakishima, MHirono, SHashimoto, YMiyachi, H Design, synthesis, and evaluation of potent, structurally novel peroxisome proliferator-activated receptor (PPAR) delta-selective agonists. Bioorg Med Chem15:5177-90 (2007) 
 
Peroxisome proliferator-activated receptor delta
Name:Peroxisome proliferator-activated receptor delta
Type:Enzyme
Mol. Mass.:49910.45
Organism:Homo sapiens (Human)
Description:Q03181
Residue:441
BDBM50214202
NameBDBM50214202
Synonyms:2-{4-n-butoxy-3-[(4-trifluoromethylbenzoylamino)methyl]phenylmethyl}butyric acid | CHEMBL389903
TypeSmall organic molecule
Emp. Form.C24H28F3NO4
Mol. Mass.451.4786
SMILESCCCCOc1ccc(CC(CC)C(O)=O)cc1CNC(=O)c1ccc(cc1)C(F)(F)F