Reaction Details
TargetPeroxisome proliferator-activated receptor alpha
LigandBDBM50214205
Substrate/Competitorn/a
Meas. Tech.ChEMBL_436999 (CHEMBL886015)
EC50 280±n/a nM
Citation Kasuga, JNakagome, IAoyama, ASako, KIshizawa, MOgura, MMakishima, MHirono, SHashimoto, YMiyachi, H Design, synthesis, and evaluation of potent, structurally novel peroxisome proliferator-activated receptor (PPAR) delta-selective agonists. Bioorg Med Chem15:5177-90 (2007) 
 
Peroxisome proliferator-activated receptor alpha
Name:Peroxisome proliferator-activated receptor alpha
Type:Enzyme
Mol. Mass.:52222.08
Organism:Homo sapiens (Human)
Description:Q07869
Residue:468
BDBM50214205
NameBDBM50214205
Synonyms:2-(4-butoxy-3-((2-fluoro-4-(trifluoromethyl)benzamido)methyl)benzyl)butanoic acid | CHEMBL229836
TypeSmall organic molecule
Emp. Form.C24H27F4NO4
Mol. Mass.469.4691
SMILESCCCCOc1ccc(CC(CC)C(O)=O)cc1CNC(=O)c1ccc(cc1F)C(F)(F)F