Reaction Details
TargetBeta-2 adrenergic receptor
LigandBDBM50214242
Substrate/Competitorn/a
Meas. Tech.ChEMBL_456298 (CHEMBL888309)
Ki 57±n/a nM
Citation Washburn, WNHarper, TWWu, GGodfrey, JDMcCann, PGirotra, RShao, CZhang, HGavai, AMikkilineni, ADejneka, TAhmed, SCaringal, YHangeland, JZhang, MCheng, PTRussell, ADSkwish, SSlusarchyk, DAAllen, GTFrohlich, BHAbboa-Offei, BECap, MWaldron, TLGeorge, RJTesfamariam, BDickinson, KESeymour, AASher, PM Arylpropanolamines: selective beta3 agonists arising from strategies to mitigate phase I metabolic transformations. Bioorg Med Chem Lett17:4290-6 (2007) 
 
Beta-2 adrenergic receptor
Name:Beta-2 adrenergic receptor
Type:n/a
Mol. Mass.:46461.69
Organism:Homo sapiens (Human)
Description:P07550
Residue:413
BDBM50214242
NameBDBM50214242
Synonyms:CHEMBL447786 | N-(5-((R)-3-((S)-3-(2-chlorophenyl)-1-(3,4-dimethoxyphenyl)propylamino)-2-hydroxypropyl)-2-hydroxyphenyl)methanesulfonamide
TypeSmall organic molecule
Emp. Form.C27H33ClN2O6S
Mol. Mass.549.079
SMILESCOc1ccc(cc1OC)[C@H](CCc1ccccc1Cl)NC[C@H](O)Cc1ccc(O)c(NS(C)(=O)=O)c1